Reaction Details
TargetPantetheinase
LigandBDBM394660
Substrate/Competitorn/a
Meas. Tech.Human Vanin-1 Enzyme Assay 1
IC50 0.800±n/a nM
Citation Casimiro-Garcia, ACondon, JSFlick, ACGopalsamy, AKirincich, SJMathias, JPStrobach, JWXiang, JSXing, LHWang, X Heterocyclic compounds as inhibitors of Vanin-1 enzyme US Patent US10308615 Publication Date 6/4/2019
 
Pantetheinase
Name:Pantetheinase
Type:Enzyme Catalytic Domain
Mol. Mass.:57002.46
Organism:Homo sapiens (Human)
Description:O95497
Residue:513
BDBM394660
NameBDBM394660
Synonyms:US10308615, Example 17 | preparation of [3-(methylsulfonyl)phenyl](2-{[1-(pyrimidin-5-yl)cyclopropyl]amino}pyrimidin-5-yl)methanone
TypeSmall organic molecule
Emp. Form.C19H17N5O3S
Mol. Mass.395.435
SMILESCS(=O)(=O)c1cccc(c1)C(=O)c1cnc(NC2(CC2)c2cncnc2)nc1