Reaction Details
Target11-beta-hydroxysteroid dehydrogenase 1
LigandBDBM29833
Substrate/CompetitorBDBM13739
Meas. Tech.11beta-HSD1 Homogeneous Time-Resolved Fluorescence (HTRF) Assay
pH7.4±n/a
Temperature310.15±n/a K
IC50 6±n/a nM
Citation Lepifre, FChristmann-Franck, SRoche, DLeriche, CCarniato, DCharon, CBozec, SDoare, LSchmidlin, FLecomte, MValeur, E Discovery and structure-guided drug design of inhibitors of 11beta-hydroxysteroid-dehydrogenase type I based on a spiro-carboxamide scaffold. Bioorg Med Chem Lett19:3682-5 (2009) 
 
11-beta-hydroxysteroid dehydrogenase 1
Name:11-beta-hydroxysteroid dehydrogenase 1
Type:Enzyme
Mol. Mass.:32409.16
Organism:Homo sapiens (Human)
Description:P28845
Residue:292
BDBM29833
BDBM13739
NameBDBM29833
Synonyms:spiro-carboxamide scaffold, 6
TypeSmall organic molecule
Emp. Form.C19H24ClNO
Mol. Mass.317.853
SMILESClc1ccc(cc1)C1(CC1)C(=O)N1CCC2(C1)CCCCC2