Reaction Details
Target11-beta-hydroxysteroid dehydrogenase 1
LigandBDBM29840
Substrate/CompetitorBDBM13739
Meas. Tech.11beta-HSD1 Homogeneous Time-Resolved Fluorescence (HTRF) Assay
pH7.4±n/a
Temperature310.15±n/a K
IC50 0.5±n/a nM
Citation Lepifre, FChristmann-Franck, SRoche, DLeriche, CCarniato, DCharon, CBozec, SDoare, LSchmidlin, FLecomte, MValeur, E Discovery and structure-guided drug design of inhibitors of 11beta-hydroxysteroid-dehydrogenase type I based on a spiro-carboxamide scaffold. Bioorg Med Chem Lett19:3682-5 (2009) 
 
11-beta-hydroxysteroid dehydrogenase 1
Name:11-beta-hydroxysteroid dehydrogenase 1
Type:Enzyme
Mol. Mass.:32409.16
Organism:Homo sapiens (Human)
Description:P28845
Residue:292
BDBM29840
BDBM13739
NameBDBM29840
Synonyms:spiro-carboxamide scaffold, 13
TypeSmall organic molecule
Emp. Form.C19H25NO
Mol. Mass.283.4079
SMILESO=C(N1CCC2(C1)CCCCC2)C1(CC1)c1ccccc1