Reaction Details
Target11-beta-hydroxysteroid dehydrogenase 1
LigandBDBM29866
Substrate/CompetitorBDBM13739
Meas. Tech.Measurement of 11beta-HSD1 Activity
pH8±n/a
Temperature295.15±n/a K
Ki 4.8±n/a nM
Citation Siu, MJohnson, TOWang, YNair, SKTaylor, WDCripps, SJMatthews, JJEdwards, MPPauly, TAErmolieff, JCastro, AHosea, NALaPaglia, AFanjul, ANVogel, JE N-(Pyridin-2-yl) arylsulfonamide inhibitors of 11beta-hydroxysteroid dehydrogenase type 1: Discovery of PF-915275. Bioorg Med Chem Lett19:3493-7 (2009) 
 
11-beta-hydroxysteroid dehydrogenase 1
Name:11-beta-hydroxysteroid dehydrogenase 1
Type:Enzyme
Mol. Mass.:32409.16
Organism:Homo sapiens (Human)
Description:P28845
Residue:292
BDBM29866
BDBM13739
NameBDBM29866
Synonyms:N-(Pyridin-2-yl) arylsulfonamide, 28
TypeSmall organic molecule
Emp. Form.C20H18N4O2S
Mol. Mass.378.448
SMILESCCNc1cccc(NS(=O)(=O)c2ccc(cc2)-c2ccc(cc2)C#N)n1