Reaction Details
TargetPeroxisome proliferator-activated receptor delta
LigandBDBM29890
Substrate/CompetitorBDBM28662
Meas. Tech.Scintillation Proximity Assay (Ki) and Cell-Based Transcription Assay (EC50)
Ki 28±n/a nM
EC50 370±n/a nM
Citation Connors, RVWang, ZHarrison, MZhang, AWanska, MHiscock, SFox, BDore, MLabelle, MSudom, AJohnstone, SLiu, JWalker, NPChai, ASiegler, KLi, YCoward, P Identification of a PPARdelta agonist with partial agonistic activity on PPARgamma. Bioorg Med Chem Lett19:3550-4 (2009) 
 
Peroxisome proliferator-activated receptor delta
Name:Peroxisome proliferator-activated receptor delta
Type:Enzyme
Mol. Mass.:49910.45
Organism:Homo sapiens (Human)
Description:Q03181
Residue:441
BDBM29890
BDBM28662
NameBDBM29890
Synonyms:alkynyl ether, 32
TypeSmall organic molecule
Emp. Form.C31H31ClO5S
Mol. Mass.551.093
SMILESCCC#CCOc1cc(COc2ccc(Cl)cc2C)ccc1Sc1ccc(OCC(O)=O)c2CCCCc12