Reaction Details
TargetPeroxisome proliferator-activated receptor delta
LigandBDBM29894
Substrate/CompetitorBDBM28662
Meas. Tech.Scintillation Proximity Assay (Ki) and Cell-Based Transcription Assay (EC50)
Ki 150±n/a nM
EC50 900±n/a nM
Citation Connors, RVWang, ZHarrison, MZhang, AWanska, MHiscock, SFox, BDore, MLabelle, MSudom, AJohnstone, SLiu, JWalker, NPChai, ASiegler, KLi, YCoward, P Identification of a PPARdelta agonist with partial agonistic activity on PPARgamma. Bioorg Med Chem Lett19:3550-4 (2009) 
 
Peroxisome proliferator-activated receptor delta
Name:Peroxisome proliferator-activated receptor delta
Type:Enzyme
Mol. Mass.:49910.45
Organism:Homo sapiens (Human)
Description:Q03181
Residue:441
BDBM29894
BDBM28662
NameBDBM29894
Synonyms:alkynyl ether, 36
TypeSmall organic molecule
Emp. Form.C29H34O5S
Mol. Mass.494.642
SMILESCCC#CCOc1cc(COC2CCCC2)ccc1Sc1ccc(OCC(O)=O)c2CCCCc12