Reaction Details
TargetPeroxisome proliferator-activated receptor gamma
LigandBDBM29868
Substrate/Competitor[3H]rosiglitazone
Meas. Tech.Scintillation Proximity Assay (Ki) and Cell-Based Transcription Assay (EC50)
Ki 300±n/a nM
EC50 3000±n/a nM
Citation Connors, RVWang, ZHarrison, MZhang, AWanska, MHiscock, SFox, BDore, MLabelle, MSudom, AJohnstone, SLiu, JWalker, NPChai, ASiegler, KLi, YCoward, P Identification of a PPARdelta agonist with partial agonistic activity on PPARgamma. Bioorg Med Chem Lett19:3550-4 (2009) 
 
Peroxisome proliferator-activated receptor gamma
Name:Peroxisome proliferator-activated receptor gamma
Type:Nuclear Receptor
Mol. Mass.:57613.46
Organism:Homo sapiens (Human)
Description:P37231
Residue:505
BDBM29868
[3H]rosiglitazone
NameBDBM29868
Synonyms:alkynyl ether, 10
TypeSmall organic molecule
Emp. Form.C27H23F3O5S
Mol. Mass.516.529
SMILESCc1c(C)c(Sc2ccc(COc3ccc(cc3)C(F)(F)F)cc2OCC#C)ccc1OCC(O)=O