Reaction Details
TargetPeroxisome proliferator-activated receptor gamma
LigandBDBM29871
Substrate/Competitor[3H]rosiglitazone
Meas. Tech.Scintillation Proximity Assay (Ki) and Cell-Based Transcription Assay (EC50)
Ki 660±n/a nM
EC50>10000±n/a nM
Citation Connors, RVWang, ZHarrison, MZhang, AWanska, MHiscock, SFox, BDore, MLabelle, MSudom, AJohnstone, SLiu, JWalker, NPChai, ASiegler, KLi, YCoward, P Identification of a PPARdelta agonist with partial agonistic activity on PPARgamma. Bioorg Med Chem Lett19:3550-4 (2009) 
 
Peroxisome proliferator-activated receptor gamma
Name:Peroxisome proliferator-activated receptor gamma
Type:Nuclear Receptor
Mol. Mass.:57613.46
Organism:Homo sapiens (Human)
Description:P37231
Residue:505
BDBM29871
[3H]rosiglitazone
NameBDBM29871
Synonyms:phenoxyacetic acid-ether, 13
TypeSmall organic molecule
Emp. Form.C29H26F3NO6S
Mol. Mass.573.58
SMILESCc1cc(COc2cc(COc3ccc(cc3)C(F)(F)F)ccc2Sc2ccc(OCC(O)=O)c(C)c2C)no1