Reaction Details
TargetPeroxisome proliferator-activated receptor gamma
LigandBDBM29893
Substrate/Competitor[3H]rosiglitazone
Meas. Tech.Scintillation Proximity Assay (Ki) and Cell-Based Transcription Assay (EC50)
Ki 200±n/a nM
EC50 1500±n/a nM
Citation Connors, RVWang, ZHarrison, MZhang, AWanska, MHiscock, SFox, BDore, MLabelle, MSudom, AJohnstone, SLiu, JWalker, NPChai, ASiegler, KLi, YCoward, P Identification of a PPARdelta agonist with partial agonistic activity on PPARgamma. Bioorg Med Chem Lett19:3550-4 (2009) 
 
Peroxisome proliferator-activated receptor gamma
Name:Peroxisome proliferator-activated receptor gamma
Type:Nuclear Receptor
Mol. Mass.:57613.46
Organism:Homo sapiens (Human)
Description:P37231
Residue:505
BDBM29893
[3H]rosiglitazone
NameBDBM29893
Synonyms:alkynyl ether, 35
TypeSmall organic molecule
Emp. Form.C29H34O6S
Mol. Mass.510.642
SMILESCCC#CCOc1cc(COC2CCOCC2)ccc1Sc1ccc(OCC(O)=O)c2CCCCc12