Reaction Details
TargetNociceptin receptor
LigandBDBM29991
Substrate/CompetitorBDBM29961
Meas. Tech.In Vitro Binding Assay (IC50) and In Vitro Agonism/Antagonism Measurements (EC50/IC50)
pH7.4±n/a
Temperature310.15±n/a K
IC50 9.9±n/a nM
EC50 38±n/a nM
Citation Kobayashi, KUchiyama, MTakahashi, HKawamoto, HIto, SYoshizumi, TNakashima, HKato, TShimizu, AYamamoto, IAsai, MMiyazoe, HOhno, AHirayama, MOzaki, STani, TIshii, YTanaka, TMochidome, TTadano, KFukuroda, TOhta, HOkamoto, O 2-Cyclohexylcarbonylbenzimidazoles as potent, orally available and brain-penetrable opioid receptor-like 1 (ORL1) antagonists. Bioorg Med Chem Lett19:3096-9 (2009) 
 
Nociceptin receptor
Name:Nociceptin receptor
Type:G Protein-Coupled Receptor (GPCR)
Mol. Mass.:40702.87
Organism:Homo sapiens (Human)
Description:P41146
Residue:370
BDBM29991
BDBM29961
NameBDBM29991
Synonyms:2-Cyclohexylcarbonylbenzimidazole, 9
TypeSmall organic molecule
Emp. Form.C21H27ClN4O2
Mol. Mass.402.918
SMILESCCN1CCN(CC1)c1cc2[nH]c(nc2cc1Cl)C(=O)C1(C)CCC(=O)CC1