Reaction Details
TargetNociceptin receptor
LigandBDBM29996
Substrate/CompetitorBDBM29961
Meas. Tech.In Vitro Binding Assay (IC50) and In Vitro Agonism/Antagonism Measurements (EC50/IC50)
pH7.4±n/a
Temperature310.15±n/a K
IC50 9.2±n/a nM
EC50 2.9±n/a nM
Citation Kobayashi, KKato, TYamamoto, IShimizu, AMizutani, SAsai, MKawamoto, HIto, SYoshizumi, THirayama, MOzaki, SOhta, HOkamoto, O Optimization of benzimidazole series as opioid receptor-like 1 (ORL1) antagonists: SAR study directed toward improvement of selectivity over hERG activity. Bioorg Med Chem Lett19:3100-3 (2009) 
 
Nociceptin receptor
Name:Nociceptin receptor
Type:G Protein-Coupled Receptor (GPCR)
Mol. Mass.:40702.87
Organism:Homo sapiens (Human)
Description:P41146
Residue:370
BDBM29996
BDBM29961
NameBDBM29996
Synonyms:benzimidazole analogue, 5a
TypeSmall organic molecule
Emp. Form.C18H27ClN4S
Mol. Mass.366.952
SMILESCCN1CCN([C@H](C)C1)c1cc2[nH]c(SC(C)(C)C)nc2cc1Cl