Reaction Details
TargetcAMP-specific 3',5'-cyclic phosphodiesterase 4A
LigandBDBM30020
Substrate/CompetitorBDBM10851
Meas. Tech.PDE4A Inhibition Assay
pH7.2±n/a
Temperature295.15±n/a K
IC50 13±0.8 nM
Citation Skoumbourdis, APLeclair, CAStefan, ETurjanski, AGMaguire, WTitus, SAHuang, RAuld, DSInglese, JAustin, CPMichnick, SWXia, MThomas, CJ Exploration and optimization of substituted triazolothiadiazines and triazolopyridazines as PDE4 inhibitors. Bioorg Med Chem Lett19:3686-92 (2009) 
 
cAMP-specific 3',5'-cyclic phosphodiesterase 4A
Name:cAMP-specific 3',5'-cyclic phosphodiesterase 4A
Type:Enzyme
Mol. Mass.:98113.27
Organism:Homo sapiens (Human)
Description:P27815
Residue:886
BDBM30020
BDBM10851
NameBDBM30020
Synonyms:triazolothiadiazine, 6
TypeSmall organic molecule
Emp. Form.C24H26N4O4S
Mol. Mass.466.553
SMILESCOc1ccc(OC)c(c1)-c1nnc2SCC(=Nn12)c1ccc(OC)c(OC2CCCC2)c1