Reaction Details
TargetcAMP-specific 3',5'-cyclic phosphodiesterase 4A
LigandBDBM30024
Substrate/CompetitorBDBM10851
Meas. Tech.PDE4A Inhibition Assay
pH7.2±n/a
Temperature295.15±n/a K
IC50 3.0±0.2 nM
Citation Skoumbourdis, APLeclair, CAStefan, ETurjanski, AGMaguire, WTitus, SAHuang, RAuld, DSInglese, JAustin, CPMichnick, SWXia, MThomas, CJ Exploration and optimization of substituted triazolothiadiazines and triazolopyridazines as PDE4 inhibitors. Bioorg Med Chem Lett19:3686-92 (2009) 
 
cAMP-specific 3',5'-cyclic phosphodiesterase 4A
Name:cAMP-specific 3',5'-cyclic phosphodiesterase 4A
Type:Enzyme
Mol. Mass.:98113.27
Organism:Homo sapiens (Human)
Description:P27815
Residue:886
BDBM30024
BDBM10851
NameBDBM30024
Synonyms:triazolothiadiazine, 10
TypeSmall organic molecule
Emp. Form.C23H24N4O5S
Mol. Mass.468.525
SMILESCOc1ccc(OC)c(c1)-c1nnc2SCC(=Nn12)c1ccc(OC)c(O[C@@H]2CCOC2)c1