Reaction Details
TargetcAMP-specific 3',5'-cyclic phosphodiesterase 4A
LigandBDBM30032
Substrate/CompetitorBDBM10851
Meas. Tech.PDE4A Inhibition Assay
pH7.2±n/a
Temperature295.15±n/a K
IC50 11±0.7 nM
Citation Skoumbourdis, APLeclair, CAStefan, ETurjanski, AGMaguire, WTitus, SAHuang, RAuld, DSInglese, JAustin, CPMichnick, SWXia, MThomas, CJ Exploration and optimization of substituted triazolothiadiazines and triazolopyridazines as PDE4 inhibitors. Bioorg Med Chem Lett19:3686-92 (2009) 
 
cAMP-specific 3',5'-cyclic phosphodiesterase 4A
Name:cAMP-specific 3',5'-cyclic phosphodiesterase 4A
Type:Enzyme
Mol. Mass.:98113.27
Organism:Homo sapiens (Human)
Description:P27815
Residue:886
BDBM30032
BDBM10851
NameBDBM30032
Synonyms:triazolothiadiazine, 26
TypeSmall organic molecule
Emp. Form.C22H22N4O4S
Mol. Mass.438.499
SMILESCOc1ccc(cc1O[C@@H]1CCOC1)C1=Nn2c(SC1)nnc2-c1ccccc1OC