Reaction Details
TargetcAMP-specific 3',5'-cyclic phosphodiesterase 4A
LigandBDBM30033
Substrate/CompetitorBDBM10851
Meas. Tech.PDE4A Inhibition Assay
pH7.2±n/a
Temperature295.15±n/a K
IC50 22±1 nM
Citation Skoumbourdis, APLeclair, CAStefan, ETurjanski, AGMaguire, WTitus, SAHuang, RAuld, DSInglese, JAustin, CPMichnick, SWXia, MThomas, CJ Exploration and optimization of substituted triazolothiadiazines and triazolopyridazines as PDE4 inhibitors. Bioorg Med Chem Lett19:3686-92 (2009) 
 
cAMP-specific 3',5'-cyclic phosphodiesterase 4A
Name:cAMP-specific 3',5'-cyclic phosphodiesterase 4A
Type:Enzyme
Mol. Mass.:98113.27
Organism:Homo sapiens (Human)
Description:P27815
Residue:886
BDBM30033
BDBM10851
NameBDBM30033
Synonyms:triazolothiadiazine, 27
TypeSmall organic molecule
Emp. Form.C18H15ClN4O2S
Mol. Mass.386.855
SMILESCOc1ccc(cc1OC)C1=Nn2c(SC1)nnc2-c1ccccc1Cl