Reaction Details
TargetcAMP-specific 3',5'-cyclic phosphodiesterase 4A
LigandBDBM30050
Substrate/CompetitorBDBM10851
Meas. Tech.PDE4A Inhibition Assay
pH7.2±n/a
Temperature295.15±n/a K
IC50 126±n/a nM
Citation Skoumbourdis, APHuang, RSouthall, NLeister, WGuo, VCho, MHInglese, JNirenberg, MAustin, CPXia, MThomas, CJ Identification of a potent new chemotype for the selective inhibition of PDE4. Bioorg Med Chem Lett18:1297-303 (2008) 
 
cAMP-specific 3',5'-cyclic phosphodiesterase 4A
Name:cAMP-specific 3',5'-cyclic phosphodiesterase 4A
Type:Enzyme
Mol. Mass.:98113.27
Organism:Homo sapiens (Human)
Description:P27815
Residue:886
BDBM30050
BDBM10851
NameBDBM30050
Synonyms:triazolothiadiazine, 5B
TypeSmall organic molecule
Emp. Form.C19H18N4O3S
Mol. Mass.382.436
SMILESCOc1cccc(c1)-c1nnc2SCC(=Nn12)c1ccc(OC)c(OC)c1