Reaction Details
TargetcAMP-specific 3',5'-cyclic phosphodiesterase 4D
LigandBDBM30126
Substrate/CompetitorBDBM10851
Meas. Tech.PDE4 Enzyme Assay
pH8±n/a
Temperature307.15±n/a K
Ki 6.3±n/a nM
Citation Cashman, JRVoelker, TZhang, HTO'Donnell, JM Dual inhibitors of phosphodiesterase-4 and serotonin reuptake. J Med Chem52:1530-9 (2009) 
 
cAMP-specific 3',5'-cyclic phosphodiesterase 4D
Name:cAMP-specific 3',5'-cyclic phosphodiesterase 4D
Type:Protein
Mol. Mass.:91092.69
Organism:Homo sapiens (Human)
Description:Q08499
Residue:809
BDBM30126
BDBM10851
NameBDBM30126
Synonyms:CHEMBL313041 | phthalazinone, 19
TypeSmall organic molecule
Emp. Form.C16H18N2O3
Mol. Mass.286.3257
SMILESCOc1ccc(cc1OC)C1=NNC(=O)C2CC=CCC12