Reaction Details
TargetSodium-dependent dopamine transporter
LigandBDBM30126
Substrate/CompetitorBDBM22166
Meas. Tech.Radioligand Binding Assay (Ki) and Inhibition of Substrate Uptake (EC50/IC50)
pH7.4±n/a
Temperature295.15±n/a K
Ki>100000±n/a nM
EC50>100000±n/a nM
Citation Cashman, JRVoelker, TZhang, HTO'Donnell, JM Dual inhibitors of phosphodiesterase-4 and serotonin reuptake. J Med Chem52:1530-9 (2009) 
 
Sodium-dependent dopamine transporter
Name:Sodium-dependent dopamine transporter
Type:Multi-pass membrane protein
Mol. Mass.:68497.11
Organism:Homo sapiens (Human)
Description:Q01959
Residue:620
BDBM30126
BDBM22166
NameBDBM30126
Synonyms:CHEMBL313041 | phthalazinone, 19
TypeSmall organic molecule
Emp. Form.C16H18N2O3
Mol. Mass.286.3257
SMILESCOc1ccc(cc1OC)C1=NNC(=O)C2CC=CCC12