Reaction Details
TargetSodium-dependent dopamine transporter
LigandBDBM30129
Substrate/CompetitorBDBM22166
Meas. Tech.Radioligand Binding Assay (Ki) and Inhibition of Substrate Uptake (EC50/IC50)
pH7.4±n/a
Temperature295.15±n/a K
Ki 5340±1083 nM
EC50 5340±1083 nM
Citation Cashman, JRVoelker, TZhang, HTO'Donnell, JM Dual inhibitors of phosphodiesterase-4 and serotonin reuptake. J Med Chem52:1530-9 (2009) 
 
Sodium-dependent dopamine transporter
Name:Sodium-dependent dopamine transporter
Type:Multi-pass membrane protein
Mol. Mass.:68497.11
Organism:Homo sapiens (Human)
Description:Q01959
Residue:620
BDBM30129
BDBM22166
NameBDBM30129
Synonyms:phthalazinone, 22
TypeSmall organic molecule
Emp. Form.C37H50FN3O5
Mol. Mass.635.8084
SMILESCOc1ccc(F)c(CCCC2CCC(CCNCCCCCN3N=C(C4CC=CCC4C3=O)c3ccc(OC)c(OC)c3)O2)c1