Reaction Details
TargetSodium-dependent serotonin transporter
LigandBDBM30131
Substrate/CompetitorBDBM22166
Meas. Tech.Radioligand Binding Assay (Ki) and Inhibition of Substrate Uptake (EC50/IC50)
pH7.4±n/a
Temperature295.15±n/a K
Ki 2.1±0.2 nM
EC50 2.5±0.6 nM
Citation Cashman, JRVoelker, TZhang, HTO'Donnell, JM Dual inhibitors of phosphodiesterase-4 and serotonin reuptake. J Med Chem52:1530-9 (2009) 
 
Sodium-dependent serotonin transporter
Name:Sodium-dependent serotonin transporter
Type:Multi-pass membrane protein
Mol. Mass.:70322.51
Organism:Homo sapiens (Human)
Description:P31645
Residue:630
BDBM30131
BDBM22166
NameBDBM30131
Synonyms:tetrahydrofuranyl ethylamine, 14
TypeSmall organic molecule
Emp. Form.C15H22FNO2
Mol. Mass.267.3391
SMILESCOc1ccc(F)cc1CCC1CCC(CCN)O1