Reaction Details
TargetSodium-dependent noradrenaline transporter
LigandBDBM30127
Substrate/CompetitorBDBM22166
Meas. Tech.PDE4 Enzyme Assay
Ki 39119±n/a nM
EC50>100000±n/a nM
Citation Cashman, JRVoelker, TZhang, HTO'Donnell, JM Dual inhibitors of phosphodiesterase-4 and serotonin reuptake. J Med Chem52:1530-9 (2009) 
 
Sodium-dependent noradrenaline transporter
Name:Sodium-dependent noradrenaline transporter
Type:Multi-pass membrane protein
Mol. Mass.:69337.72
Organism:Homo sapiens (Human)
Description:P23975
Residue:617
BDBM30127
BDBM22166
NameBDBM30127
Synonyms:CHEMBL480988 | phthalazinone, 20
TypeSmall organic molecule
Emp. Form.C21H27BrN2O3
Mol. Mass.435.355
SMILESCOc1ccc(cc1OC)C1=NN(CCCCCBr)C(=O)C2CC=CCC12