Reaction Details
TargetSodium-dependent noradrenaline transporter
LigandBDBM30128
Substrate/CompetitorBDBM22166
Meas. Tech.PDE4 Enzyme Assay
Ki 1748±n/a nM
EC50 957±n/a nM
Citation Cashman, JRVoelker, TZhang, HTO'Donnell, JM Dual inhibitors of phosphodiesterase-4 and serotonin reuptake. J Med Chem52:1530-9 (2009) 
 
Sodium-dependent noradrenaline transporter
Name:Sodium-dependent noradrenaline transporter
Type:Multi-pass membrane protein
Mol. Mass.:69337.72
Organism:Homo sapiens (Human)
Description:P23975
Residue:617
BDBM30128
BDBM22166
NameBDBM30128
Synonyms:phthalazinone, 21
TypeSmall organic molecule
Emp. Form.C36H48FN3O5
Mol. Mass.621.7818
SMILESCOc1ccc(F)c(CCC2CCC(CCNCCCCCN3N=C(C4CC=CCC4C3=O)c3ccc(OC)c(OC)c3)O2)c1