Reaction Details
TargetEnvelope glycoprotein gp160
LigandBDBM77108
Substrate/Competitorn/a
Meas. Tech.Anti-HIV Cytoprotection Assay
EC50>10000±0.0 nM
Citation Lanier, ER Methods of treating retroviral infections and related dosage regimes US Patent US9694024 Publication Date 7/4/2017
 
Envelope glycoprotein gp160
Name:Envelope glycoprotein gp160
Type:n/a
Mol. Mass.:97241.93
Organism:Human immunodeficiency virus type 1 group M subtype B (isolate HXB2)
Description:n/a
Residue:856
BDBM77108
NameBDBM77108
Synonyms:CMX157-220
TypeSmall organic molecule
Emp. Form.C16H26N5O7P
Mol. Mass.431.3807
SMILESC[C@H](Cn1cnc2c(N)ncnc12)OCP(O)(=O)OCCCOCCCC(O)=O