Reaction Details
TargetPolyunsaturated fatty acid 5-lipoxygenase
LigandBDBM31130
Substrate/CompetitorBDBM22319
Meas. Tech.Inhibition of 5-LO Product Formation in Cell-Free Systems (IC50) and in Intact Neutrophils (EC50/IC50)
pH7.4±n/a
Temperature310.15±n/a K
IC50 150±20 nM
EC50 650±300 nM
Citation Karg, EMLuderer, SPergola, CBühring, URossi, ANorthoff, HSautebin, LTroschütz, RWerz, O Structural optimization and biological evaluation of 2-substituted 5-hydroxyindole-3-carboxylates as potent inhibitors of human 5-lipoxygenase. J Med Chem52:3474-83 (2009) 
 
Polyunsaturated fatty acid 5-lipoxygenase
Name:Polyunsaturated fatty acid 5-lipoxygenase
Type:Enzyme
Mol. Mass.:77972.74
Organism:Homo sapiens (Human)
Description:Recombinant protein was purified from E. coli lysate. After ammonium sulfate precipitation and subsequent steps, the supernatant (S100) was used for 5-LO activity assay.
Residue:674
BDBM31130
BDBM22319
NameBDBM31130
Synonyms:5-hydroxy-1H-benzo[g]indole-3-carboxylate, 11i
TypeSmall organic molecule
Emp. Form.C23H21NO4
Mol. Mass.375.4171
SMILESCCOC(=O)c1c(Cc2ccc(OC)cc2)[nH]c2c1cc(O)c1ccccc21