Reaction Details
TargetD-amino-acid oxidase
LigandBDBM31171
Substrate/CompetitorBDBM23167
Meas. Tech.DAAO in Vitro Activity Assay
pH8.5±n/a
Temperature295.15±n/a K
IC50 3260±n/a nM
Citation Duplantier, AJBecker, SLBohanon, MJBorzilleri, KAChrunyk, BADowns, JTHu, LYEl-Kattan, AJames, LCLiu, SLu, JMaklad, NMansour, MNMente, SPiotrowski, MASakya, SMSheehan, SSteyn, SJStrick, CAWilliams, VAZhang, L Discovery, SAR, and pharmacokinetics of a novel 3-hydroxyquinolin-2(1H)-one series of potent D-amino acid oxidase (DAAO) inhibitors. J Med Chem52:3576-85 (2009) 
 
D-amino-acid oxidase
Name:D-amino-acid oxidase
Type:Homodimer
Mol. Mass.:39476.06
Organism:Homo sapiens (Human)
Description:P14920
Residue:347
BDBM31171
BDBM23167
NameBDBM31171
Synonyms:3-hydroxyquinolin-2(1H)-one, 25
TypeSmall organic molecule
Emp. Form.C10H9NO2
Mol. Mass.175.184
SMILESCn1c2ccccc2cc(O)c1=O