Reaction Details
TargetD-amino-acid oxidase
LigandBDBM31173
Substrate/CompetitorBDBM23167
Meas. Tech.DAAO in Vitro Activity Assay
pH8.5±n/a
Temperature295.15±n/a K
IC50 3±n/a nM
Citation Duplantier, AJBecker, SLBohanon, MJBorzilleri, KAChrunyk, BADowns, JTHu, LYEl-Kattan, AJames, LCLiu, SLu, JMaklad, NMansour, MNMente, SPiotrowski, MASakya, SMSheehan, SSteyn, SJStrick, CAWilliams, VAZhang, L Discovery, SAR, and pharmacokinetics of a novel 3-hydroxyquinolin-2(1H)-one series of potent D-amino acid oxidase (DAAO) inhibitors. J Med Chem52:3576-85 (2009) 
 
D-amino-acid oxidase
Name:D-amino-acid oxidase
Type:Homodimer
Mol. Mass.:39476.06
Organism:Homo sapiens (Human)
Description:P14920
Residue:347
BDBM31173
BDBM23167
NameBDBM31173
Synonyms:naphthyridinone analog., 27
TypeSmall organic molecule
Emp. Form.C8H4ClFN2O2
Mol. Mass.214.581
SMILESOc1cc2c(Cl)c(F)cnc2[nH]c1=O