Reaction Details
TargetD-aspartate oxidase
LigandBDBM31164
Substrate/CompetitorBDBM31174
Meas. Tech.DAAO in Vitro Activity Assay
IC50>7640±n/a nM
Citation Duplantier, AJBecker, SLBohanon, MJBorzilleri, KAChrunyk, BADowns, JTHu, LYEl-Kattan, AJames, LCLiu, SLu, JMaklad, NMansour, MNMente, SPiotrowski, MASakya, SMSheehan, SSteyn, SJStrick, CAWilliams, VAZhang, L Discovery, SAR, and pharmacokinetics of a novel 3-hydroxyquinolin-2(1H)-one series of potent D-amino acid oxidase (DAAO) inhibitors. J Med Chem52:3576-85 (2009) 
 
D-aspartate oxidase
Name:D-aspartate oxidase
Type:Oxidoreductase
Mol. Mass.:37543.06
Organism:Homo sapiens (Human)
Description:Recombinant human DDO expressed and purified from sf9 insect cells, was used in enzyme assays.
Residue:341
BDBM31164
BDBM31174
NameBDBM31164
Synonyms:naphthyridinone analog.,18
TypeSmall organic molecule
Emp. Form.C8H6N2O2
Mol. Mass.162.1454
SMILESOc1cc2cccnc2[nH]c1=O