Reaction Details
TargetD-aspartate oxidase
LigandBDBM31169
Substrate/CompetitorBDBM31174
Meas. Tech.DAAO in Vitro Activity Assay
IC50 32300±n/a nM
Citation Duplantier, AJBecker, SLBohanon, MJBorzilleri, KAChrunyk, BADowns, JTHu, LYEl-Kattan, AJames, LCLiu, SLu, JMaklad, NMansour, MNMente, SPiotrowski, MASakya, SMSheehan, SSteyn, SJStrick, CAWilliams, VAZhang, L Discovery, SAR, and pharmacokinetics of a novel 3-hydroxyquinolin-2(1H)-one series of potent D-amino acid oxidase (DAAO) inhibitors. J Med Chem52:3576-85 (2009) 
 
D-aspartate oxidase
Name:D-aspartate oxidase
Type:Oxidoreductase
Mol. Mass.:37543.06
Organism:Homo sapiens (Human)
Description:Recombinant human DDO expressed and purified from sf9 insect cells, was used in enzyme assays.
Residue:341
BDBM31169
BDBM31174
NameBDBM31169
Synonyms:3-hydroxyquinolin-2(1H)-one, 23 | US9701638, 14
TypeSmall organic molecule
Emp. Form.C10H9NO2
Mol. Mass.175.184
SMILESCc1c(O)c(=O)[nH]c2ccccc12