Reaction Details
TargetD-amino-acid oxidase
LigandBDBM31150
Substrate/CompetitorBDBM10852
Meas. Tech.Biacore Binding of DAAO Inhibitors
Kd 38±n/a nM
Citation Duplantier, AJBecker, SLBohanon, MJBorzilleri, KAChrunyk, BADowns, JTHu, LYEl-Kattan, AJames, LCLiu, SLu, JMaklad, NMansour, MNMente, SPiotrowski, MASakya, SMSheehan, SSteyn, SJStrick, CAWilliams, VAZhang, L Discovery, SAR, and pharmacokinetics of a novel 3-hydroxyquinolin-2(1H)-one series of potent D-amino acid oxidase (DAAO) inhibitors. J Med Chem52:3576-85 (2009) 
 
D-amino-acid oxidase
Name:D-amino-acid oxidase
Type:Homodimer
Mol. Mass.:39476.06
Organism:Homo sapiens (Human)
Description:P14920
Residue:347
BDBM31150
BDBM10852
NameBDBM31150
Synonyms:3-hydroxyquinolin-2(1H)-one, 4
TypeSmall organic molecule
Emp. Form.C9H6FNO2
Mol. Mass.179.1478
SMILESOc1cc2ccc(F)cc2[nH]c1=O