Reaction Details
TargetcAMP and cAMP-inhibited cGMP 3',5'-cyclic phosphodiesterase 10A
LigandBDBM31595
Substrate/CompetitorBDBM10851
Meas. Tech.PDE Enzyme Inhibition Assay
pH7.5±n/a
Temperature296.15±n/a K
IC50 4.76±n/a nM
Citation Verhoest, PRChapin, DSCorman, MFonseca, KHarms, JFHou, XMarr, ESMenniti, FSNelson, FO'Connor, RPandit, JProulx-Lafrance, CSchmidt, AWSchmidt, CJSuiciak, JALiras, S Discovery of a Novel Class of Phosphodiesterase 10A Inhibitors and Identification of Clinical Candidate 2-[4-(1-Methyl-4-pyridin-4-yl-1H-pyrazol-3-yl)-phenoxymethyl]-quinoline (PF-2545920) for the Treatment of Schizophrenia (dagger) dagger Coordinates of the PDE10A crystal structures have been depo J Med Chem52:5188-96 (2009) 
 
cAMP and cAMP-inhibited cGMP 3',5'-cyclic phosphodiesterase 10A
Name:cAMP and cAMP-inhibited cGMP 3',5'-cyclic phosphodiesterase 10A
Type:Enzyme
Mol. Mass.:90160.88
Organism:Rattus norvegicus (rat)
Description:PDE10A was generated from the full-length recombinant rat clone transfected into Sf9 cells.
Residue:794
BDBM31595
BDBM10851
NameBDBM31595
Synonyms:substituted pyrazole, 12
TypeSmall organic molecule
Emp. Form.C26H22N4O
Mol. Mass.406.4791
SMILESCCn1ncc(c1-c1ccc(OCc2ccc3ccccc3n2)cc1)-c1ccncc1