Reaction Details
TargetCytochrome P450 3A1
LigandBDBM31657
Substrate/Competitorerythromycin
IC50 1400±n/a nM
Citation Vlahakis, JZHum, MRahman, MNJia, ZNakatsu, KSzarek, WA Synthesis and evaluation of imidazole-dioxolane compounds as selective heme oxygenase inhibitors: effect of substituents at the 4-position of the dioxolane ring. Bioorg Med Chem17:2461-75 (2009) 
 
Cytochrome P450 3A1
Name:Cytochrome P450 3A1
Type:Enzyme
Mol. Mass.:57928.74
Organism:Rattus norvegicus (rat)
Description:CYP3A1/3A2 prepared from rat liver microsomes was used in enzyme assays.
Residue:504
BDBM31657
erythromycin
NameBDBM31657
Synonyms:imidazole-dioxolane, 9
TypeSmall organic molecule
Emp. Form.C22H23ClN2O3S
Mol. Mass.430.948
SMILESOc1ccc(SC[C@@H]2CO[C@@](CCc3ccc(Cl)cc3)(Cn3ccnc3)O2)cc1