Reaction Details
TargetCytochrome P450 3A1
LigandBDBM31672
Substrate/Competitorerythromycin
IC50 3400±n/a nM
Citation Vlahakis, JZHum, MRahman, MNJia, ZNakatsu, KSzarek, WA Synthesis and evaluation of imidazole-dioxolane compounds as selective heme oxygenase inhibitors: effect of substituents at the 4-position of the dioxolane ring. Bioorg Med Chem17:2461-75 (2009) 
 
Cytochrome P450 3A1
Name:Cytochrome P450 3A1
Type:Enzyme
Mol. Mass.:57928.74
Organism:Rattus norvegicus (rat)
Description:CYP3A1/3A2 prepared from rat liver microsomes was used in enzyme assays.
Residue:504
BDBM31672
erythromycin
NameBDBM31672
Synonyms:imidazole-dioxolane, 24
TypeSmall organic molecule
Emp. Form.C22H22BrClN2O3
Mol. Mass.477.779
SMILESClc1ccc(CC[C@@]2(Cn3ccnc3)OC[C@@H](COc3ccc(Br)cc3)O2)cc1