Reaction Details
TargetThymidylate synthase
LigandBDBM18796
Substrate/CompetitorBDBM18754
Meas. Tech.Thymidylate Synthase (TS) Assay
pH7.4±n/a
Temperature303.15±n/a K
IC50 9500±n/a nM
Citation Gangjee, ALi, WKisliuk, RLCody, VPace, JPiraino, JMakin, J Design, synthesis, and X-ray crystal structure of classical and nonclassical 2-amino-4-oxo-5-substituted-6-ethylthieno[2,3-d]pyrimidines as dual thymidylate synthase and dihydrofolate reductase inhibitors and as potential antitumor agents. J Med Chem52:4892-902 (2009) 
 
Thymidylate synthase
Name:Thymidylate synthase
Type:Enzyme
Mol. Mass.:35718.07
Organism:Homo sapiens (Human)
Description:n/a
Residue:313
BDBM18796
BDBM18754
NameBDBM18796
Synonyms:(2S)-2-{[4-(2-{2-amino-4-oxo-1H,4H,7H-pyrrolo[2,3-d]pyrimidin-5-yl}ethyl)phenyl]formamido}pentanedioic acid Pemetrexed
TypeSmall organic molecule
Emp. Form.C20H21N5O6
Mol. Mass.427.4106
SMILESNc1nc2[nH]cc(CCc3ccc(cc3)C(=O)N[C@@H](CCC(O)=O)C(O)=O)c2c(=O)[nH]1