Reaction Details
TargetPteridine reductase
LigandBDBM31795
Substrate/CompetitorBDBM31792
Meas. Tech.PTR1 Activity Assay
pH6±n/a
Temperature296.15±n/a K
Ki 9800±n/a nM
Citation Mpamhanga, CPSpinks, DTulloch, LBShanks, EJRobinson, DACollie, ITFairlamb, AHWyatt, PGFrearson, JAHunter, WNGilbert, IHBrenk, R One scaffold, three binding modes: novel and selective pteridine reductase 1 inhibitors derived from fragment hits discovered by virtual screening. J Med Chem52:4454-65 (2009) 
 
Pteridine reductase
Name:Pteridine reductase
Type:Oxidoreductase
Mol. Mass.:28470.17
Organism:Trypanosoma brucei brucei
Description:n/a
Residue:268
BDBM31795
BDBM31792
NameBDBM31795
Synonyms:2-aminobenzimidazole deriv., 6
TypeSmall organic molecule
Emp. Form.C14H13N3
Mol. Mass.223.2731
SMILESCc1cccc(c1)-c1ccc2nc(N)[nH]c2c1