Reaction Details
TargetPteridine reductase
LigandBDBM31796
Substrate/CompetitorBDBM31792
Meas. Tech.PTR1 Activity Assay
pH6±n/a
Temperature296.15±n/a K
Ki>200000±n/a nM
Citation Mpamhanga, CPSpinks, DTulloch, LBShanks, EJRobinson, DACollie, ITFairlamb, AHWyatt, PGFrearson, JAHunter, WNGilbert, IHBrenk, R One scaffold, three binding modes: novel and selective pteridine reductase 1 inhibitors derived from fragment hits discovered by virtual screening. J Med Chem52:4454-65 (2009) 
 
Pteridine reductase
Name:Pteridine reductase
Type:Oxidoreductase
Mol. Mass.:28470.17
Organism:Trypanosoma brucei brucei
Description:n/a
Residue:268
BDBM31796
BDBM31792
NameBDBM31796
Synonyms:2-aminobenzimidazole deriv., 7
TypeSmall organic molecule
Emp. Form.C9H11N3
Mol. Mass.161.2037
SMILESCCn1c(N)nc2ccccc12