Reaction Details
TargetPteridine reductase
LigandBDBM31800
Substrate/CompetitorBDBM31792
Meas. Tech.PTR1 Activity Assay
pH6±n/a
Temperature296.15±n/a K
Ki 47±n/a nM
Citation Mpamhanga, CPSpinks, DTulloch, LBShanks, EJRobinson, DACollie, ITFairlamb, AHWyatt, PGFrearson, JAHunter, WNGilbert, IHBrenk, R One scaffold, three binding modes: novel and selective pteridine reductase 1 inhibitors derived from fragment hits discovered by virtual screening. J Med Chem52:4454-65 (2009) 
 
Pteridine reductase
Name:Pteridine reductase
Type:Oxidoreductase
Mol. Mass.:28470.17
Organism:Trypanosoma brucei brucei
Description:n/a
Residue:268
BDBM31800
BDBM31792
NameBDBM31800
Synonyms:2-aminobenzimidazole deriv., 11
TypeSmall organic molecule
Emp. Form.C17H17Cl2N3O
Mol. Mass.350.242
SMILESCCCOc1cccc2nc(N)n(Cc3ccc(Cl)c(Cl)c3)c12