Reaction Details
TargetRetinoic acid receptor gamma [183-417]
LigandBDBM31888
Substrate/CompetitorBDBM31883
Meas. Tech.Retinoid Competition Binding Assay
pH7.9±n/a
Temperature277.15±n/a K
Kd 68±n/a nM
Citation Klaholz, BPMitschler, AMoras, D Structural basis for isotype selectivity of the human retinoic acid nuclear receptor. J Mol Biol302:155-70 (2000) 
 
Retinoic acid receptor gamma [183-417]
Name:Retinoic acid receptor gamma [183-417]
Type:Ligand-binding domain
Mol. Mass.:26502.27
Organism:Homo sapiens (Human)
Description:P13631[183-417]
Residue:235
BDBM31888
BDBM31883
NameBDBM31888
Synonyms:CD666
TypeSmall organic molecule
Emp. Form.C24H28O3
Mol. Mass.364.4773
SMILESCC1(C)CCC(C)(C)c2cc(ccc12)C(O)\C=C\c1ccc(cc1)C(O)=O