Reaction Details
TargetRetinoic acid receptor alpha [200-419]
LigandBDBM31883
Substrate/CompetitorBDBM31883
Meas. Tech.Retinoid Competition Binding Assay
pH7.9±n/a
Temperature277.15±n/a K
Kd 0.4±n/a nM
Citation Klaholz, BPMitschler, AMoras, D Structural basis for isotype selectivity of the human retinoic acid nuclear receptor. J Mol Biol302:155-70 (2000) 
 
Retinoic acid receptor alpha [200-419]
Name:Retinoic acid receptor alpha [200-419]
Type:Ligand-binding domain
Mol. Mass.:24746.59
Organism:Homo sapiens (Human)
Description:P10276[200-419]
Residue:220
BDBM31883
BDBM31883
NameBDBM31883
Synonyms:9-cis-retinoic acid (9cRA) AT-RA CHEMBL38 SMR000058245 Vitamin A acid [3H]Retinoic acid [3H]tretinoin cid_444795
Typeradiolabeled ligand
Emp. Form.C20H28O2
Mol. Mass.300.4351
SMILESC\C(\C=C\C1=C(C)CCCC1(C)C)=C/C=C/C(/C)=C/C(O)=O