Reaction Details
TargetCholinesterase
LigandBDBM31904
Substrate/CompetitorBDBM8978
Meas. Tech.AChE Inhibition Assay
IC50 13200±n/a nM
Citation Camps, PFormosa, XGaldeano, CMuñoz-Torrero, DRamírez, LGómez, EIsambert, NLavilla, RBadia, AClos, MVBartolini, MMancini, FAndrisano, VArce, MPRodríguez-Franco, MIHuertas, ODafni, TLuque, FJ Pyrano[3,2-c]quinoline-6-chlorotacrine hybrids as a novel family of acetylcholinesterase- and beta-amyloid-directed anti-Alzheimer compounds. J Med Chem52:5365-79 (2009) 
 
Cholinesterase
Name:Cholinesterase
Type:Homotetramer
Mol. Mass.:68422.27
Organism:Homo sapiens (Human)
Description:P06276
Residue:602
BDBM31904
BDBM8978
NameBDBM31904
Synonyms:CHEMBL345124 Propidium Iodide, 2 | propidium iodide
TypeSmall organic molecule
Emp. Form.C27H34N4
Mol. Mass.414.5846
SMILESCC[N+](C)(CC)CCCn1c(-c2ccccc2)c2cc(N)ccc2c2ccc(=[NH2+])cc12