Reaction Details
TargetProcathepsin L [114-333,T223A]
LigandBDBM31989
Substrate/CompetitorBDBM22047
Meas. Tech.Cathepsin Inhibition Assay
pH7±n/a
Temperature310.15±n/a K
IC50 79±n/a nM
Citation Asaad, NBethel, PACoulson, MDDawson, JEFord, SJGerhardt, SGrist, MHamlin, GAJames, MJJones, EVKaroutchi, GIKenny, PWMorley, ADOldham, KRankine, NRyan, DWells, SLWood, LAugustin, MKrapp, SSimader, HSteinbacher, S Dipeptidyl nitrile inhibitors of Cathepsin L. Bioorg Med Chem Lett19:4280-3 (2009) 
 
Procathepsin L [114-333,T223A]
Name:Procathepsin L [114-333,T223A]
Type:Cysteine Protease
Mol. Mass.:24128.88
Organism:Homo sapiens (Human)
Description:P07711[114-333,T223A]
Residue:220
BDBM31989
BDBM22047
NameBDBM31989
Synonyms:Dipeptidyl nitrile inhibitor, 22
TypeSmall organic molecule
Emp. Form.C18H18ClN3O2S
Mol. Mass.375.872
SMILESCc1cc(C(=O)N[C@@H](Cc2cccc(Cl)c2)C(=O)NCC#N)c(C)s1