Reaction Details
TargetHeat shock 70 kDa protein 1A
LigandBDBM32371
Substrate/CompetitorBDBM32369
Meas. Tech.HSP70 Fluorescence Polarization Assay
pH7.4±n/a
Temperature296.15±n/a K
IC50 17000±n/a nM
Citation Williamson, DSBorgognoni, JClay, ADaniels, ZDokurno, PDrysdale, MJFoloppe, NFrancis, GLGraham, CJHowes, RMacias, ATMurray, JBParsons, RShaw, TSurgenor, AETerry, LWang, YWood, MMassey, AJ Novel adenosine-derived inhibitors of 70 kDa heat shock protein, discovered through structure-based design. J Med Chem52:1510-3 (2009) 
 
Heat shock 70 kDa protein 1A
Name:Heat shock 70 kDa protein 1A
Type:Chaperone
Mol. Mass.:70043.82
Organism:Homo sapiens (Human)
Description:n/a
Residue:641
BDBM32371
BDBM32369
NameBDBM32371
Synonyms:adenosine-derived inhibitor (Grp78), 3 | adenosine-derived inhibitor, 5
TypeSmall organic molecule
Emp. Form.C11H16N6O4
Mol. Mass.296.2825
SMILESCNc1nc2c(N)ncnc2n1[C@@H]1O[C@H](CO)[C@@H](O)[C@H]1O