Reaction Details
TargetBaculoviral IAP repeat-containing protein 3 [255-322]
LigandBDBM32579
Substrate/CompetitorBDBM17342
Meas. Tech.Fluorescence Polarization Affinity Measurements
pH7.2±n/a
Temperature295.15±n/a K
Ki 114±n/a nM
Citation Ndubaku, CVarfolomeev, EWang, LZobel, KLau, KElliott, LOMaurer, BFedorova, AVDynek, JNKoehler, MHymowitz, SGTsui, VDeshayes, KFairbrother, WJFlygare, JAVucic, D Antagonism of c-IAP and XIAP proteins is required for efficient induction of cell death by small-molecule IAP antagonists. ACS Chem Biol4:557-66 (2009) 
 
Baculoviral IAP repeat-containing protein 3 [255-322]
Name:Baculoviral IAP repeat-containing protein 3 [255-322]
Type:BIR3 domain
Mol. Mass.:7852.71
Organism:Homo sapiens (Human)
Description:Q13489[255-322]
Residue:68
BDBM32579
BDBM17342
NameBDBM32579
Synonyms:CS-2
TypeSmall organic molecule
Emp. Form.C27H36N6O3
Mol. Mass.492.6131
SMILESCN[C@@H](C)C(=O)N[C@@H](C1CCCCC1)C(=O)N1CCC[C@H]1C(=O)Nc1ccccc1-c1ncccn1