Reaction Details
TargetEpithelial discoidin domain-containing receptor 1
LigandBDBM88267
Substrate/Competitorn/a
Meas. Tech.LanthaScreen Eu Kinase Binding Assay
Temperature298.15±n/a K
IC50 10.00±n/a nM
Commentsextracted
Citation Murata, TNiizuma, SHara, SKawada, HHada, KShimada, HTanaka, HNakanishi, Y Benzamide derivative US Patent US9695118 Publication Date 7/4/2017
 
Epithelial discoidin domain-containing receptor 1
Name:Epithelial discoidin domain-containing receptor 1
Type:Tyrosine-protein kinase
Mol. Mass.:101130.02
Organism:Homo sapiens (Human)
Description:Q08345
Residue:913
BDBM88267
NameBDBM88267
Synonyms:US9695118, 683
TypeSmall organic molecule
Emp. Form.C24H26Cl2F3N3O4S
Mol. Mass.580.447
SMILESCCS(=O)(=O)c1ccc(Cl)cc1CNC(=O)c1cc(Cl)c(CN2CCOC3(CNC3)C2)c(c1)C(F)(F)F