Reaction Details
TargetProthrombin
LigandBDBM32654
Substrate/CompetitorBDBM23868
Meas. Tech.Enzyme Inhibition Assay
pH7.4±n/a
Temperature298.15±n/a K
Ki 47±27 nM
Citation Baum, BMuley, LHeine, ASmolinski, MHangauer, DKlebe, G Think twice: understanding the high potency of bis(phenyl)methane inhibitors of thrombin. J Mol Biol391:552-64 (2009) 
 
Prothrombin
Name:Prothrombin
Type:Protein
Mol. Mass.:70029.57
Organism:Homo sapiens (Human)
Description:P00734
Residue:622
BDBM32654
BDBM23868
NameBDBM32654
Synonyms:m-chlorobenzylamide, 3
TypeSmall organic molecule
Emp. Form.C27H28ClN3O2
Mol. Mass.461.983
SMILESN[C@H](C(c1ccccc1)c1ccccc1)C(=O)N1CCCC1C(=O)NCc1cccc(Cl)c1