Reaction Details
TargetProthrombin
LigandBDBM32659
Substrate/CompetitorBDBM23868
Meas. Tech.Enzyme Inhibition Assay
pH7.4±n/a
Temperature298.15±n/a K
Ki 8700±1000 nM
Citation Baum, BMuley, LHeine, ASmolinski, MHangauer, DKlebe, G Think twice: understanding the high potency of bis(phenyl)methane inhibitors of thrombin. J Mol Biol391:552-64 (2009) 
 
Prothrombin
Name:Prothrombin
Type:Protein
Mol. Mass.:70029.57
Organism:Homo sapiens (Human)
Description:P00734
Residue:622
BDBM32659
BDBM23868
NameBDBM32659
Synonyms:m-chlorobenzylamide, 8
TypeSmall organic molecule
Emp. Form.C23H32ClN3O3
Mol. Mass.433.971
SMILESCC(=O)N[C@H](CC1CCCCC1)C(=O)N1CCCC1C(=O)NCc1cccc(Cl)c1