Reaction Details
TargetHeat shock protein HSP 90-beta
LigandBDBM33236
Substrate/CompetitorBDBM15527
Meas. Tech.Fluorescence Polarization (FP) Assay
pH7.4±n/a
Temperature296.15±n/a K
IC50 47±n/a nM
Citation Brough, PABarril, XBorgognoni, JChene, PDavies, NGDavis, BDrysdale, MJDymock, BEccles, SAGarcia-Echeverria, CFromont, CHayes, AHubbard, REJordan, AMJensen, MRMassey, AMerrett, APadfield, AParsons, RRadimerski, TRaynaud, FIRobertson, ARoughley, SDSchoepfer, JSimmonite, HSharp, SYSurgenor, AValenti, MWalls, SWebb, PWood, MWorkman, PWright, L Combining hit identification strategies: fragment-based and in silico approaches to orally active 2-aminothieno[2,3-d]pyrimidine inhibitors of the Hsp90 molecular chaperone. J Med Chem52:4794-809 (2009) 
 
Heat shock protein HSP 90-beta
Name:Heat shock protein HSP 90-beta
Type:Molecular Chaperone
Mol. Mass.:83229.45
Organism:Homo sapiens (Human)
Description:P08238
Residue:724
BDBM33236
BDBM15527
NameBDBM33236
Synonyms:thieno[2,3-d]pyrimidine, 34c
TypeSmall organic molecule
Emp. Form.C21H22Cl2F3N5O2S
Mol. Mass.536.398
SMILESCCN(CC)CCOc1cc(c(Cl)cc1Cl)-c1nc(N)nc2sc(cc12)C(=O)NCC(F)(F)F