Reaction Details
TargetGenome polyprotein [1394-1440]/[1476-1660]
LigandBDBM33256
Substrate/CompetitorBDBM33248
Meas. Tech.Enzyme Inhibition Assay
IC50 1300±n/a nM
Citation Bodenreider, CBeer, DKeller, THSonntag, SWen, DYap, LYau, YHShochat, SGHuang, DZhou, TCaflisch, ASu, XCOzawa, KOtting, GVasudevan, SGLescar, JLim, SP A fluorescence quenching assay to discriminate between specific and nonspecific inhibitors of dengue virus protease. Anal Biochem395:195-204 (2009) 
 
Genome polyprotein [1394-1440]/[1476-1660]
Name:Genome polyprotein [1394-1440]/[1476-1660]
Synonyms:Dengue Virus 4 (DENV4) NS2B-NS3 Protease
Type:Cofactor/Enzyme
Mol. Mass.:n/a
Description:n/a
Components:This complex has 2 components.
Component 1
Name:Genome polyprotein [1394-1440]
Type:Cofactor Domain
Mol. Mass.:5233.59
Organism:Dengue virus 4 (H241)
Description:Q58HT7[1394-1440]
Residue:47
dlsleka anvqwdemad itgsspiiev kqdedgsfsi rdieetnmit
Component 2
Name:Genome polyprotein [1476-1660]
Synonyms:Flavivirus NS3 serine protease POLG_DEN4P
Type:Catalytic Domain
Mol. Mass.:20242.25
Organism:Dengue virus 4 (H241)
Description:Q58HT7[1476-1660]
Residue:185
BDBM33256
BDBM33248
NameBDBM33256
Synonyms:phthalazine-based compound, 7
TypeSmall organic molecule
Emp. Form.C31H26N6O2
Mol. Mass.514.5771
SMILESCOC(=O)c1ccc(cc1)-c1ccc(Nc2nnc(Nc3ccc(cc3)C3=NCCN3)c3ccccc23)cc1