Reaction Details
TargetCarbonic anhydrase 1
LigandBDBM33269
Substrate/CompetitorBDBM10856
Meas. Tech.CA Inhibition Assay
pH7.4±n/a
Temperature298.15±n/a K
Ki 621±n/a nM
Citation Carta, FMaresca, AScozzafava, AVullo, DSupuran, CT Carbonic anhydrase inhibitors. Diazenylbenzenesulfonamides are potent and selective inhibitors of the tumor-associated isozymes IX and XII over the cytosolic isoforms I and II. Bioorg Med Chem17:7093-9 (2009) 
 
Carbonic anhydrase 1
Name:Carbonic anhydrase 1
Type:Enzyme
Mol. Mass.:28873.37
Organism:Homo sapiens (Human)
Description:P00915
Residue:261
BDBM33269
BDBM10856
NameBDBM33269
Synonyms:CHEMBL277836 cid_75522 | p-Phenyldiazenyl derivative, 4
TypeSmall organic molecule
Emp. Form.C14H16N4O2S
Mol. Mass.304.367
SMILESCN(C)c1ccc(cc1)\N=N\c1ccc(cc1)S(N)(=O)=O