Reaction Details
TargetCarbonic anhydrase 2
LigandBDBM33271
Substrate/CompetitorBDBM10856
Meas. Tech.CA Inhibition Assay
pH7.4±n/a
Temperature298.15±n/a K
Ki 104±n/a nM
Citation Carta, FMaresca, AScozzafava, AVullo, DSupuran, CT Carbonic anhydrase inhibitors. Diazenylbenzenesulfonamides are potent and selective inhibitors of the tumor-associated isozymes IX and XII over the cytosolic isoforms I and II. Bioorg Med Chem17:7093-9 (2009) 
 
Carbonic anhydrase 2
Name:Carbonic anhydrase 2
Type:Enzyme
Mol. Mass.:29250.71
Organism:Homo sapiens (Human)
Description:P00918
Residue:260
BDBM33271
BDBM10856
NameBDBM33271
Synonyms:azo-sulfonamide, 1f
TypeSmall organic molecule
Emp. Form.C14H15N4O5S2
Mol. Mass.383.423
SMILESCN(CS([O-])(=O)=O)c1ccc(cc1)\N=N\c1ccc(cc1)S(N)(=O)=O