Reaction Details
TargetCarbonic anhydrase 2
LigandBDBM33275
Substrate/CompetitorBDBM10856
Meas. Tech.CA Inhibition Assay
pH7.4±n/a
Temperature298.15±n/a K
Ki 107±n/a nM
Citation Carta, FMaresca, AScozzafava, AVullo, DSupuran, CT Carbonic anhydrase inhibitors. Diazenylbenzenesulfonamides are potent and selective inhibitors of the tumor-associated isozymes IX and XII over the cytosolic isoforms I and II. Bioorg Med Chem17:7093-9 (2009) 
 
Carbonic anhydrase 2
Name:Carbonic anhydrase 2
Type:Enzyme
Mol. Mass.:29250.71
Organism:Homo sapiens (Human)
Description:P00918
Residue:260
BDBM33275
BDBM10856
NameBDBM33275
Synonyms:azo-sulfonamide, 2e
TypeSmall organic molecule
Emp. Form.C13H13N4O5S2
Mol. Mass.369.397
SMILESNS(=O)(=O)c1cccc(c1)\N=N\c1ccc(NCS([O-])(=O)=O)cc1